{"text_format":"1","workbook":"xlsx","n_sheets":6,"sheets":["基礎データ","1回目　集計表","2回目　集計表","ＳＮＳ個票","ＳＮＳ学級票","ＳＮＳ学級票（度数分布表）"],"not_rendered":{"charts":27,"images":0,"macros":1,"external_links":0,"defined_names":3,"comments":0,"pivot_tables":0},"unopened":[],"bounds":{"document_bytes":16777216,"sheet_cells":100000,"rows_first":2000,"rows_last":500,"rows_between":2000,"halvings":0,"cell_chars":16384,"cell_head_chars":4096},"cells_cut":0,"cells_raw":0,"read":"whole","date_system":"1900"}

{"sheet":"基礎データ","index":0,"n_rows":49,"n_cols":13,"rows_kept":49,"cut":false,"hidden":false,"merged":[[2,1,2,3]]}
[]
[]
[null,"名　簿",null,null,null,"学年",null,"組"]
[null,"出席番号","氏名","性別"]
[null,1,null,null,null,"１回目","令和","元","年",4,"月",4,"日"]
[null,2,null,null,null,"２回目","令和",2,"年",5,"月",5,"日"]
[null,3]
[null,4]
[null,5]
[null,6]
[null,7]
[null,8]
[null,9]
[null,10]
[null,11]
[null,12]
[null,13]
[null,14]
[null,15]
[null,16]
{"$rows_left_out":30}
{"sheet":"1回目　集計表","index":1,"n_rows":116,"n_cols":23,"rows_kept":116,"cut":false,"hidden":false,"merged":[[66,0,66,2],[66,3,66,22],[68,0,70,0],[68,1,70,1],[69,3,70,3],[69,4,70,4],[69,5,70,5],[69,7,70,7],[69,9,70,9],[69,22,70,22],[69,19,70,19],[69,20,70,20],[69,18,70,18],[69,6,70,6],[69,14,70,14],[69,15,70,15],[69,16,70,16],[69,17,70,17],[69,21,70,21],[69,8,70,8],[69,10,70,10],[69,11,70,11],[69,12,70,12],[69,13,70,13],[3,22,4,22],[57,0,57,1],[51,0,51,1],[52,0,52,1],[53,0,53,1],[54,0,54,1],[55,0,55,1],[56,0,56,1],[50,0,50,1],[3,11,4,11],[3,12,4,12],[3,13,4,13],[3,14,4,14],[3,15,4,15],[3,16,4,16],[3,17,4,17],[3,18,4,18],[3,19,4,19],[3,20,4,20],[3,21,4,21],[3,9,4,9],[3,10,4,10],[3,6,4,6],[3,7,4,7],[3,8,4,8],[2,0,4,0],[2,1,4,1],[3,3,4,3],[3,4,4,4],[3,5,4,5]]}
[]
[1,2,3,4,5,6,7,8,9,10,11,12,13,14,15,16,17,18,19,20,21,22,23]
["番号","氏名",4,1,2,3,4,5,6,7,8,9,10,11,12,13,14,15,16,17,18,19,20]
[null,null,"性別\n\n男１\n女２","ＳＮＳの１週間当たりの利用日数","平日にＳＮＳを利用する時間","ＳＮＳを使い始めてからの経験年月","ＳＮＳでメッセージのやり取りをする友達の人数","ＳＮＳでメッセージのやり取りをするグループの数","個人情報は出さないようにしている。","相手が不愉快な気持ちになるような内容は書かないようにしている。","メッセージを送る前に問題がないか確認をするようにしている。","長時間にならないようにメッセージのやり取りをしている。","メッセージのやり取りで嫌な気持ちになったときは、直接、会話で気持ちを伝えるようにしている。","友達とのやり取りで困ったときは親や先生に相談するようにしている。","友達とメッセージのやり取りをすることで友達の気持ちを確かめることができる。","友達とメッセージのやり取りをすることで、友達とのつながりをもてる。","友達とメッセージのやり取りをすることで、寂しさをすぐにまぎらわすことができる。","メッセージがきたらすぐに返事をする。","友達から送られてくるメッセージをチェックする。","メッセージのやり取りをなかなか終わらせられない。","自分が送信したメッセージに対する反応がない。","メッセージの送信後，「あの伝え方でよかったのだろうか」と悩む。","知らないところで自分のことについてメッセージのやり取りをしているのではないかと心配になる。"]
[]
[{"$f":"基礎データ!B5","v":1},{"$f":"B72","v":0},{"$f":"IF(C72=\"男\",1,IF(C72=\"女\",2,0))","v":0},{"$f":"IF(D72=0,0,D72)","v":0},0,0,0,0,0,0,0,0,0,0,{"$f":"IF(O72=4,1,IF(O72=3,2,IF(O72=2,3,IF(O72=1,4,0))))","v":0},0,0,0,0,0,0,0,0]
[{"$f":"基礎データ!B6","v":2},{"$f":"B73","v":0},{"$f":"IF(C73=\"男\",1,IF(C73=\"女\",2,0))","v":0},{"$f":"IF(D73=0,0,D73)","v":0},0,0,0,0,0,0,0,0,0,0,{"$f":"IF(O73=4,1,IF(O73=3,2,IF(O73=2,3,IF(O73=1,4,0))))","v":0},0,0,0,0,0,0,0,0]
[{"$f":"基礎データ!B7","v":3},0,0,{"$f":"IF(D74=0,0,D74)","v":0},0,0,0,0,0,0,0,0,0,0,{"$f":"IF(O74=4,1,IF(O74=3,2,IF(O74=2,3,IF(O74=1,4,0))))","v":0},0,0,0,0,0,0,0,0]
[{"$f":"基礎データ!B8","v":4},0,0,{"$f":"IF(D75=0,0,D75)","v":0},0,0,0,0,0,0,0,0,0,0,{"$f":"IF(O75=4,1,IF(O75=3,2,IF(O75=2,3,IF(O75=1,4,0))))","v":0},0,0,0,0,0,0,0,0]
[{"$f":"基礎データ!B9","v":5},0,0,{"$f":"IF(D76=0,0,D76)","v":0},0,0,0,0,0,0,0,0,0,0,{"$f":"IF(O76=4,1,IF(O76=3,2,IF(O76=2,3,IF(O76=1,4,0))))","v":0},0,0,0,0,0,0,0,0]
[{"$f":"基礎データ!B10","v":6},0,0,{"$f":"IF(D77=0,0,D77)","v":0},0,0,0,0,0,0,0,0,0,0,{"$f":"IF(O77=4,1,IF(O77=3,2,IF(O77=2,3,IF(O77=1,4,0))))","v":0},0,0,0,0,0,0,0,0]
[{"$f":"基礎データ!B11","v":7},0,0,{"$f":"IF(D78=0,0,D78)","v":0},0,0,0,0,0,0,0,0,0,0,{"$f":"IF(O78=4,1,IF(O78=3,2,IF(O78=2,3,IF(O78=1,4,0))))","v":0},0,0,0,0,0,0,0,0]
[{"$f":"基礎データ!B12","v":8},0,0,{"$f":"IF(D79=0,0,D79)","v":0},0,0,0,0,0,0,0,0,0,0,{"$f":"IF(O79=4,1,IF(O79=3,2,IF(O79=2,3,IF(O79=1,4,0))))","v":0},0,0,0,0,0,0,0,0]
[{"$f":"基礎データ!B13","v":9},0,0,{"$f":"IF(D80=0,0,D80)","v":0},0,0,0,0,0,0,0,0,0,0,{"$f":"IF(O80=4,1,IF(O80=3,2,IF(O80=2,3,IF(O80=1,4,0))))","v":0},0,0,0,0,0,0,0,0]
[{"$f":"基礎データ!B14","v":10},0,0,{"$f":"IF(D81=0,0,D81)","v":0},0,0,0,0,0,0,0,0,0,0,{"$f":"IF(O81=4,1,IF(O81=3,2,IF(O81=2,3,IF(O81=1,4,0))))","v":0},0,0,0,0,0,0,0,0]
[{"$f":"基礎データ!B15","v":11},0,0,{"$f":"IF(D82=0,0,D82)","v":0},0,0,0,0,0,0,0,0,0,0,{"$f":"IF(O82=4,1,IF(O82=3,2,IF(O82=2,3,IF(O82=1,4,0))))","v":0},0,0,0,0,0,0,0,0]
[{"$f":"基礎データ!B16","v":12},0,0,{"$f":"IF(D83=0,0,D83)","v":0},0,0,0,0,0,0,0,0,0,0,{"$f":"IF(O83=4,1,IF(O83=3,2,IF(O83=2,3,IF(O83=1,4,0))))","v":0},0,0,0,0,0,0,0,0]
[{"$f":"基礎データ!B17","v":13},0,0,{"$f":"IF(D84=0,0,D84)","v":0},0,0,0,0,0,0,0,0,0,0,{"$f":"IF(O84=4,1,IF(O84=3,2,IF(O84=2,3,IF(O84=1,4,0))))","v":0},0,0,0,0,0,0,0,0]
[{"$f":"基礎データ!B18","v":14},0,0,{"$f":"IF(D85=0,0,D85)","v":0},0,0,0,0,0,0,0,0,0,0,{"$f":"IF(O85=4,1,IF(O85=3,2,IF(O85=2,3,IF(O85=1,4,0))))","v":0},0,0,0,0,0,0,0,0]
[{"$f":"基礎データ!B19","v":15},0,0,{"$f":"IF(D86=0,0,D86)","v":0},0,0,0,0,0,0,0,0,0,0,{"$f":"IF(O86=4,1,IF(O86=3,2,IF(O86=2,3,IF(O86=1,4,0))))","v":0},0,0,0,0,0,0,0,0]
{"$rows_left_out":97}
{"sheet":"2回目　集計表","index":2,"n_rows":116,"n_cols":23,"rows_kept":116,"cut":false,"hidden":false,"merged":[[50,0,50,1],[51,0,51,1],[52,0,52,1],[53,0,53,1],[3,15,4,15],[3,11,4,11],[3,12,4,12],[3,13,4,13],[3,14,4,14],[2,0,4,0],[2,1,4,1],[3,7,4,7],[3,8,4,8],[3,9,4,9],[3,10,4,10],[2,2,4,2],[54,0,54,1],[55,0,55,1],[56,0,56,1],[57,0,57,1],[66,0,66,2],[69,3,70,3],[69,4,70,4],[69,5,70,5],[68,0,70,0],[68,1,70,1],[69,6,70,6],[69,7,70,7],[69,8,70,8],[69,9,70,9],[69,10,70,10],[69,22,70,22],[69,12,70,12],[69,13,70,13],[69,14,70,14],[69,15,70,15],[69,16,70,16],[69,17,70,17],[69,18,70,18],[69,11,70,11],[66,3,66,22],[3,21,4,21],[3,22,4,22],[3,16,4,16],[3,17,4,17],[3,18,4,18],[3,19,4,19],[3,20,4,20],[3,3,4,3],[3,4,4,4],[3,5,4,5],[3,6,4,6],[69,19,70,19],[69,20,70,20],[69,21,70,21]]}
[]
[1,2,3,4,5,6,7,8,9,10,11,12,13,14,15,16,17,18,19,20,21,22,23]
["番号","氏名","性別\n\n男１\n女２",1,2,3,4,5,6,7,8,9,10,11,12,13,14,15,16,17,18,19,20]
[null,null,null,"ＳＮＳの１週間当たりの利用日数","平日にＳＮＳを利用する時間","ＳＮＳを使い始めてからの経験年月","ＳＮＳでメッセージのやり取りをする友達の人数","ＳＮＳでメッセージのやり取りをするグループの数","個人情報は出さないようにしている。","相手が不愉快な気持ちになるような内容は書かないようにしている。","メッセージを送る前に問題がないか確認をするようにしている。","長時間にならないようにメッセージのやり取りをしている。","メッセージのやり取りで嫌な気持ちになったときは、直接、会話で気持ちを伝えるようにしている。","友達とのやり取りで困ったときは親や先生に相談するようにしている。","友達とメッセージのやり取りをすることで友達の気持ちを確かめることができる。","友達とメッセージのやり取りをすることで、友達とのつながりをもてる。","友達とメッセージのやり取りをすることで、寂しさをすぐにまぎらわすことができる。","メッセージがきたらすぐに返事をする。","友達から送られてくるメッセージをチェックする。","メッセージのやり取りをなかなか終わらせられない。","自分が送信したメッセージに対する反応がない。","メッセージの送信後，「あの伝え方でよかったのだろうか」と悩む。","知らないところで自分のことについてメッセージのやり取りをしているのではないかと心配になる。"]
[]
[1,{"$f":"B72","v":0},{"$f":"IF(C72=\"男\",1,IF(C72=\"女\",2,0))","v":0},{"$f":"IF(D72=0,0,D72)","v":0},0,0,0,0,0,0,0,0,0,0,{"$f":"IF(O72=4,1,IF(O72=3,2,IF(O72=2,3,IF(O72=1,4,0))))","v":0},0,0,0,0,0,0,0,0]
[2,{"$f":"B73","v":0},{"$f":"IF(C73=\"男\",1,IF(C73=\"女\",2,0))","v":0},0,0,0,0,0,0,0,0,0,0,0,0,0,0,0,0,0,0,0,0]
[3,0,0,0,0,0,0,0,0,0,0,0,0,0,0,0,0,0,0,0,0,0,0]
[4,0,0,0,0,0,0,0,0,0,0,0,0,0,0,0,0,0,0,0,0,0,0]
[5,0,0,0,0,0,0,0,0,0,0,0,0,0,0,0,0,0,0,0,0,0,0]
[6,0,0,0,0,0,0,0,0,0,0,0,0,0,0,0,0,0,0,0,0,0,0]
[7,0,0,0,0,0,0,0,0,0,0,0,0,0,0,0,0,0,0,0,0,0,0]
[8,0,0,0,0,0,0,0,0,0,0,0,0,0,0,0,0,0,0,0,0,0,0]
[9,0,0,0,0,0,0,0,0,0,0,0,0,0,0,0,0,0,0,0,0,0,0]
[10,0,0,0,0,0,0,0,0,0,0,0,0,0,0,0,0,0,0,0,0,0,0]
[11,0,0,0,0,0,0,0,0,0,0,0,0,0,0,0,0,0,0,0,0,0,0]
[12,0,0,0,0,0,0,0,0,0,0,0,0,0,0,0,0,0,0,0,0,0,0]
[13,0,0,0,0,0,0,0,0,0,0,0,0,0,0,0,0,0,0,0,0,0,0]
[14,0,0,0,0,0,0,0,0,0,0,0,0,0,0,0,0,0,0,0,0,0,0]
[15,0,0,0,0,0,0,0,0,0,0,0,0,0,0,0,0,0,0,0,0,0,0]
{"$rows_left_out":97}
{"sheet":"ＳＮＳ個票","index":3,"n_rows":72,"n_cols":52,"rows_kept":72,"cut":false,"hidden":false,"merged":[[62,3,62,4],[62,7,62,8],[57,24,57,25],[57,28,57,29],[68,28,68,29],[68,32,68,33],[68,7,68,8],[68,12,68,13],[62,33,62,34],[62,29,62,30],[1,25,1,26],[1,28,1,29],[1,31,1,32],[0,0,0,36],[2,31,2,32],[2,19,2,22],[2,23,2,24],[2,25,2,26],[2,28,2,29],[1,5,1,6],[1,9,1,10],[1,11,1,17],[1,19,1,22],[1,23,1,24],[3,2,4,10],[9,1,9,2],[9,3,9,19],[5,21,5,28],[5,30,5,35],[8,1,8,2],[7,1,7,2],[7,3,7,19],[8,3,8,19],[9,30,9,35],[9,21,9,28],[7,21,7,28],[7,30,7,35],[8,21,8,28],[8,30,8,35],[13,2,14,12],[51,2,52,10],[10,21,10,28],[10,30,10,35],[11,21,11,28],[11,30,11,35],[15,2,16,2],[10,1,10,2],[11,1,11,2],[10,3,10,19],[11,3,11,19]]}
["「ＳＮＳチェックシート」　－個票－"]
[null,{"$f":"基礎データ!G3","v":0},"年",{"$f":"基礎データ!I3","v":0},"組",{"$f":"AS4","v":1},null,"番",null,"氏名",null,{"$f":"VLOOKUP(F2,基礎データ!B5:C45,2)","v":0},null,null,null,null,null,null,null,"１回目",null,null,null,"令和",null,{"$f":"基礎データ!H5","v":"元"},null,"年",{"$f":"基礎データ!J5","v":4},null,"月",{"$f":"基礎データ!L5","v":4},null,"日"]
[null,null,null,null,null,null,null,null,null,null,null,null,null,null,null,null,null,null,null,"２回目",null,null,null,"令和",null,{"$f":"基礎データ!H6","v":2},null,"年",{"$f":"基礎データ!J6","v":5},null,"月",{"$f":"基礎データ!L6","v":5},null,"日",null,null,null,null,"※裏表印刷の設定をする"]
[null,null,"【　ＳＮＳの利用実態　】",null,null,null,null,null,null,null,null,null,null,null,null,null,null,null,null,null,null,null,null,null,null,null,null,null,null,null,null,null,null,null,null,null,null,null,null,null,null,null,1,38,1]
[null,null,null,null,null,null,null,null,null,null,null,null,null,null,null,null,null,null,null,null,null,null,null,null,null,null,null,null,null,null,null,null,null,null,null,null,null,null,null,null,null,null,"開始","終了","開始"]
[null,null,null,null,null,null,null,null,null,null,null,null,null,null,null,null,null,null,null,null,null,"１回目調査",null,null,null,null,null,null,null,null,"２回目調査"]
[]
[null,"（１）",null,"ＳＮＳの１週間当たりの利用日数",null,null,null,null,null,null,null,null,null,null,null,null,null,null,null,null,null,{"$f":"AN8","v":0},null,null,null,null,null,null,null,"⇒",{"$f":"AV8","v":0},null,null,null,null,null,null,{"$f":"VLOOKUP($F$2,'1回目　集計表'!$A$6:$W$50,4,1)","v":0},"・",{"$f":"IF(AL8=1,\"ほとんど使わない\",IF(AL8=2,\"あまり使わない\",IF(AL8=3,\"ときどき使う\",IF(AL8=4,\"ほぼ毎日使う\",))))","v":0},null,null,null,null,null,{"$f":"VLOOKUP($F$2,'2回目　集計表'!$A$6:$W$50,4,1)","v":0},"・",{"$f":"IF(AT8=1,\"ほとんど使わない\",IF(AT8=2,\"あまり使わない\",IF(AT8=3,\"ときどき使う\",IF(AT8=4,\"ほぼ毎日使う\",))))","v":0}]
[null,"（２）",null,"平日にＳＮＳを利用する時間",null,null,null,null,null,null,null,null,null,null,null,null,null,null,null,null,null,{"$f":"AN9","v":0},null,null,null,null,null,null,null,"⇒",{"$f":"AV9","v":0},null,null,null,null,null,null,{"$f":"VLOOKUP($F$2,'1回目　集計表'!$A$6:$W$50,5,1)","v":0},"・",{"$f":"IF(AL9=1,\"30分未満\",IF(AL9=2,\"30分～１時間未満\",IF(AL9=3,\"１～２時間未満\",IF(AL9=4,\"２時間以上\",))))","v":0},null,null,null,null,null,{"$f":"VLOOKUP($F$2,'2回目　集計表'!$A$6:$W$50,5,1)","v":0},"・",{"$f":"IF(AT9=1,\"30分未満\",IF(AT9=2,\"30分～１時間未満\",IF(AT9=3,\"１～２時間未満\",IF(AT9=4,\"２時間以上\",))))","v":0}]
[null,"（３）",null,"ＳＮＳを使い始めてからの経験年月",null,null,null,null,null,null,null,null,null,null,null,null,null,null,null,null,null,{"$f":"AN10","v":0},null,null,null,null,null,null,null,"⇒",{"$f":"AV10","v":0},null,null,null,null,null,null,{"$f":"VLOOKUP($F$2,'1回目　集計表'!$A$6:$W$50,6,1)","v":0},"・",{"$f":"IF(AL10=1,\"６か月未満\",IF(AL10=2,\"６か月～１年\",IF(AL10=3,\"１～２年\",IF(AL10=4,\"２年以上\",))))","v":0},null,null,null,null,null,{"$f":"VLOOKUP($F$2,'2回目　集計表'!$A$6:$W$50,6,1)","v":0},"・",{"$f":"IF(AT10=1,\"６か月未満\",IF(AT10=2,\"６か月～１年\",IF(AT10=3,\"１～２年\",IF(AT10=4,\"２年以上\",))))","v":0}]
[null,"（４）",null,"ＳＮＳでメッセージのやり取りをするグループの数",null,null,null,null,null,null,null,null,null,null,null,null,null,null,null,null,null,{"$f":"AN11","v":0},null,null,null,null,null,null,null,"⇒",{"$f":"AV11","v":0},null,null,null,null,null,null,{"$f":"VLOOKUP($F$2,'1回目　集計表'!$A$6:$W$50,7,1)","v":0},"・",{"$f":"IF(AL11=1,\"グループチャットはしない\",IF(AL11=2,\"１～10グループ\",IF(AL11=3,\"11～20グループ\",IF(AL11=4,\"21グループ以上\",))))","v":0},null,null,null,null,null,{"$f":"VLOOKUP($F$2,'2回目　集計表'!$A$6:$W$50,7,1)","v":0},"・",{"$f":"IF(AT11=1,\"グループチャットはしない\",IF(AT11=2,\"１～10グループ\",IF(AT11=3,\"11～20グループ\",IF(AT11=4,\"21グループ以上\",))))","v":0}]
[null,"（５）",null,"普段，利用しているＳＮＳのメンバー",null,null,null,null,null,null,null,null,null,null,null,null,null,null,null,null,null,{"$f":"AN12","v":0},null,null,null,null,null,null,null,"⇒",{"$f":"AV12","v":0},null,null,null,null,null,null,{"$f":"VLOOKUP($F$2,'1回目　集計表'!$A$6:$W$50,8,1)","v":0},"・",{"$f":"IF(AL12=1,\"ほとんどが学校内のメンバー\",IF(AL12=2,\"学校内のメンバーが半分より多い\",IF(AL12=3,\"学校外のメンバーが半分より多い\",IF(AL12=4,\"ほとんどが学校外のメンバー\",))))","v":0},null,null,null,null,null,{"$f":"VLOOKUP($F$2,'2回目　集計表'!$A$6:$W$50,8,1)","v":0},"・",{"$f":"IF(AT12=1,\"ほとんどが学校内のメンバー\",IF(AT12=2,\"学校内のメンバーが半分より多い\",IF(AT12=3,\"学校外のメンバーが半分より多い\",IF(AT12=4,\"ほとんどが学校外のメンバー\",))))","v":0}]
[]
[null,null,"【　ＳＮＳ観点の下位項目　】"]
[]
[]
[]
[null,null,null,null,null,null,null,null,null,null,null,null,null,null,null,null,null,null,null,null,null,null,null,null,null,null,null,null,null,null,null,null,null,null,null,null,null,null,null,null,null,null,null,null,"『ＳＮＳをめぐるトラブル』への備えの意識\n"]
[null,null,null,null,null,null,null,null,null,null,null,null,null,null,null,null,null,null,null,null,null,null,null,null,null,null,null,null,null,null,null,null,null,null,null,null,null,null,null,null,null,null,null,null,"質問項目","１回目","２回目","横軸","Y軸"]
[null,null,null,null,null,null,null,null,null,null,null,null,null,null,null,null,null,null,null,null,null,null,null,null,null,null,null,null,null,null,null,null,null,null,null,null,null,null,null,null,null,null,null,null,"（６）",{"$f":"VLOOKUP($F$2,'1回目　集計表'!$A$6:$W$50,9,1)","v":0},{"$f":"VLOOKUP($F$2,'2回目　集計表'!$A$6:$W$50,9,1)","v":0},0,4]
{"$rows_left_out":53}
{"sheet":"ＳＮＳ学級票","index":4,"n_rows":103,"n_cols":52,"rows_kept":103,"cut":false,"hidden":false,"merged":[[98,28,98,30],[99,28,99,30],[100,28,100,30],[101,28,101,30],[102,28,102,30],[97,28,97,30],[97,22,97,24],[98,22,98,24],[99,22,99,24],[100,22,100,24],[101,22,101,24],[102,22,102,24],[97,25,97,27],[98,25,98,27],[99,25,99,27],[100,25,100,27],[101,25,101,27],[102,25,102,27],[32,20,32,30],[32,31,32,32],[32,34,32,35],[33,20,33,30],[33,31,33,32],[33,34,33,35],[30,20,30,30],[30,31,30,32],[30,34,30,35],[31,20,31,30],[31,31,31,32],[31,34,31,35],[18,34,18,35],[19,20,19,30],[19,31,19,32],[19,34,19,35],[27,20,27,30],[27,31,27,32],[27,34,27,35],[29,31,29,32],[29,34,29,35],[25,20,25,30],[25,31,25,32],[25,34,25,35],[26,20,26,30],[26,31,26,32],[26,34,26,35],[0,0,0,36],[1,5,1,6],[1,9,1,10],[1,11,1,17],[1,19,1,22],[1,23,1,24],[1,25,1,26],[1,28,1,29],[1,31,1,32],[2,19,2,22],[2,23,2,24],[2,25,2,26],[2,28,2,29],[2,31,2,32],[35,2,36,12],[37,2,38,2],[77,2,78,10],[6,41,11,42],[5,34,5,35],[5,31,5,32],[13,34,13,35],[14,20,14,30],[14,31,14,32],[14,34,14,35],[15,20,15,30],[15,31,15,32],[15,34,15,35],[3,2,4,10],[4,21,4,27],[4,30,4,36],[23,31,23,32],[23,34,23,35],[24,20,24,30],[6,43,6,46],[24,1,24,2],[24,3,24,19],[30,1,30,2],[30,3,30,19],[12,1,12,2],[12,3,12,19],[18,1,18,2],[18,3,18,19],[6,1,6,2],[6,3,6,19],[11,31,11,32],[24,31,24,32],[24,34,24,35],[17,31,17,32],[17,34,17,35],[18,20,18,30],[20,20,20,30],[20,31,20,32],[20,34,20,35],[21,20,21,30],[21,31,21,32],[21,34,21,35],[18,31,18,32],[6,50,6,53],[18,41,18,42],[18,48,18,49],[24,41,24,42],[24,48,24,49],[6,48,11,49],[11,34,11,35],[12,20,12,30],[12,31,12,32],[12,34,12,35],[13,20,13,30],[13,31,13,32],[6,31,6,32],[7,31,7,32],[8,31,8,32],[6,34,6,35],[7,34,7,35],[8,34,8,35],[9,34,9,35],[6,20,6,30],[7,20,7,30],[8,20,8,30],[9,20,9,30],[9,31,9,32]]}
["「ＳＮＳチェックシート」　－学級票－"]
[null,{"$f":"基礎データ!G3","v":0},"年",{"$f":"基礎データ!I3","v":0},"組",null,null,null,null,null,null,null,null,null,null,null,null,null,null,"１回目",null,null,null,"令和",null,{"$f":"基礎データ!H5","v":"元"},null,"年",{"$f":"基礎データ!J5","v":4},null,"月",{"$f":"基礎データ!L5","v":4},null,"日"]
[null,null,null,null,null,null,null,null,null,null,null,null,null,null,null,null,null,null,null,"２回目",null,null,null,"令和",null,{"$f":"基礎データ!H6","v":2},null,"年",{"$f":"基礎データ!J6","v":5},null,"月",{"$f":"基礎データ!L6","v":5},null,"日"]
[null,null,"【　ＳＮＳの利用実態　】"]
[]
[null,null,null,null,null,null,null,null,null,null,null,null,null,null,null,null,null,null,null,null,null,null,null,null,null,null,null,null,null,null,null,"１回目",null,null,"２回目"]
[null,"（１）",null,"ＳＮＳの１週間当たりの利用日数",null,null,null,null,null,null,null,null,null,null,null,null,null,null,null,null,"ほぼ毎日使う",null,null,null,null,null,null,null,null,null,null,{"$f":"'1回目　集計表'!$D51","v":0},null,"⇒",{"$f":"'2回目　集計表'!$D51","v":0}]
[null,null,null,null,null,null,null,null,null,null,null,null,null,null,null,null,null,null,null,null,"ときどき使う（週に３～４日くらい）",null,null,null,null,null,null,null,null,null,null,{"$f":"'1回目　集計表'!$D52","v":0},null,"⇒",{"$f":"'2回目　集計表'!$D52","v":0}]
[null,null,null,null,null,null,null,null,null,null,null,null,null,null,null,null,null,null,null,null,"あまり使わない（週に１～２日くらい）",null,null,null,null,null,null,null,null,null,null,{"$f":"'1回目　集計表'!$D53","v":0},null,"⇒",{"$f":"'2回目　集計表'!$D53","v":0}]
[null,null,null,null,null,null,null,null,null,null,null,null,null,null,null,null,null,null,null,null,"ほとんど使わない（月に数回）",null,null,null,null,null,null,null,null,null,null,{"$f":"'1回目　集計表'!$D54","v":0},null,"⇒",{"$f":"'2回目　集計表'!$D54","v":0}]
[]
[null,null,null,null,null,null,null,null,null,null,null,null,null,null,null,null,null,null,null,null,null,null,null,null,null,null,null,null,null,null,null,"１回目",null,null,"２回目"]
[null,"（２）",null,"平日にＳＮＳを利用する時間",null,null,null,null,null,null,null,null,null,null,null,null,null,null,null,null,"２時間以上",null,null,null,null,null,null,null,null,null,null,{"$f":"'1回目　集計表'!$E51","v":0},null,"⇒",{"$f":"'2回目　集計表'!$E51","v":0}]
[null,null,null,null,null,null,null,null,null,null,null,null,null,null,null,null,null,null,null,null,"１～２時間未満",null,null,null,null,null,null,null,null,null,null,{"$f":"'1回目　集計表'!$E52","v":0},null,"⇒",{"$f":"'2回目　集計表'!$E52","v":0}]
[null,null,null,null,null,null,null,null,null,null,null,null,null,null,null,null,null,null,null,null,"３０分～１時間未満",null,null,null,null,null,null,null,null,null,null,{"$f":"'1回目　集計表'!$E53","v":0},null,"⇒",{"$f":"'2回目　集計表'!$E53","v":0}]
[null,null,null,null,null,null,null,null,null,null,null,null,null,null,null,null,null,null,null,null,"３０分未満",null,null,null,null,null,null,null,null,null,null,{"$f":"'1回目　集計表'!$E54","v":0},null,"⇒",{"$f":"'2回目　集計表'!$E54","v":0}]
[]
[null,null,null,null,null,null,null,null,null,null,null,null,null,null,null,null,null,null,null,null,null,null,null,null,null,null,null,null,null,null,null,"１回目",null,null,"２回目"]
[null,"（３）",null,"ＳＮＳを使い始めてからの経験年月",null,null,null,null,null,null,null,null,null,null,null,null,null,null,null,null,"２年以上",null,null,null,null,null,null,null,null,null,null,{"$f":"'1回目　集計表'!$F51","v":0},null,"⇒",{"$f":"'2回目　集計表'!$F51","v":0}]
[null,null,null,null,null,null,null,null,null,null,null,null,null,null,null,null,null,null,null,null,"１～２年",null,null,null,null,null,null,null,null,null,null,{"$f":"'1回目　集計表'!$F52","v":0},null,"⇒",{"$f":"'2回目　集計表'!$F52","v":0}]
{"$rows_left_out":84}
{"sheet":"ＳＮＳ学級票（度数分布表）","index":5,"n_rows":207,"n_cols":52,"rows_kept":207,"cut":false,"hidden":false,"merged":[[81,23,82,24],[81,25,81,28],[81,30,82,31],[81,32,81,35],[82,40,83,40],[83,1,83,22],[83,23,83,24],[83,30,83,31],[55,23,55,24],[55,30,55,31],[73,40,74,40],[74,1,74,22],[74,23,74,24],[74,30,74,31],[62,25,62,28],[62,30,63,31],[62,32,62,35],[63,40,64,40],[64,1,64,22],[64,23,64,24],[80,30,80,35],[78,1,78,20],[80,40,81,40],[93,1,93,18],[84,1,84,22],[84,23,84,24],[84,30,84,31],[84,40,85,40],[85,1,85,22],[85,23,85,24],[85,30,85,31],[86,1,86,22],[86,23,86,24],[86,30,86,31],[86,40,87,40],[91,6,91,13],[91,16,91,19],[91,23,91,24],[91,26,91,27],[91,29,91,30],[90,16,90,19],[90,23,90,24],[90,26,90,27],[90,29,90,30],[18,34,18,35],[59,1,59,14],[56,23,56,24],[56,30,56,31],[53,23,54,24],[53,25,53,28],[53,30,54,31],[18,3,18,18],[24,3,25,18],[30,3,31,18],[50,1,50,20],[24,1,24,2],[24,20,24,30],[24,31,24,32],[36,2,37,13],[33,34,33,35],[26,34,26,35],[21,31,21,32],[45,1,45,22],[41,23,42,24],[41,30,42,31],[43,23,43,24],[43,30,43,31],[3,2,4,11],[38,1,38,18],[69,1,69,11],[6,31,6,32],[15,20,15,30],[15,31,15,32],[17,31,17,32],[12,3,12,19],[33,20,33,30],[33,31,33,32],[46,30,46,31],[53,32,53,35],[55,1,55,22],[6,34,6,35],[14,34,14,35],[15,34,15,35],[17,34,17,35],[12,34,12,35],[13,34,13,35],[56,1,56,22],[29,34,29,35],[30,34,30,35],[26,20,26,30],[20,34,20,35],[6,1,6,2],[12,1,12,2],[12,31,12,32],[13,20,13,30],[13,31,13,32],[12,20,12,30],[30,1,30,2],[30,20,30,30],[30,31,30,32],[26,31,26,32],[6,3,6,19],[6,20,6,30],[18,1,18,2],[18,20,18,30],[18,31,18,32],[40,40,41,40],[42,40,43,40],[44,40,45,40],[46,40,47,40],[48,2,49,13],[51,1,51,35],[52,23,52,28],[52,30,52,35],[46,1,46,22],[45,23,45,24],[45,30,45,31],[44,23,44,24],[44,30,44,31],[44,1,44,22],[46,23,46,24],[6,50,6,53],[7,20,7,30],[7,31,7,32],[7,34,7,35],[8,20,8,30],[8,31,8,32],[8,34,8,35],[9,20,9,30],[43,1,43,22],[24,41,24,42],[24,48,24,49],[6,41,11,42],[9,31,9,32],[9,34,9,35],[11,31,11,32],[11,34,11,35],[6,43,6,46],[6,48,11,49],[18,48,18,49],[19,20,19,30],[19,31,19,32],[19,34,19,35],[20,20,20,30],[20,31,20,32],[1,13,1,14],[1,16,1,19],[1,23,1,24],[1,26,1,27],[1,29,1,30],[18,41,18,42],[25,20,25,30],[25,31,25,32],[25,34,25,35],[21,34,21,35],[23,31,23,32],[23,34,23,35],[24,34,24,35],[4,21,4,27],[4,30,4,36],[5,31,5,32],[5,34,5,35],[2,16,2,19],[2,23,2,24],[2,26,2,27],[2,29,2,30],[14,20,14,30],[14,31,14,32],[21,20,21,30],[53,40,54,40],[55,40,56,40],[60,1,60,35],[61,23,61,28],[61,30,61,35],[125,1,125,20],[143,1,143,14],[168,1,168,11],[0,0,0,36],[41,32,41,35],[40,30,40,35],[41,25,41,28],[40,23,40,28],[39,1,39,35],[31,20,31,30],[31,31,31,32],[31,34,31,35],[32,20,32,30],[32,31,32,32],[32,34,32,35],[27,20,27,30],[27,31,27,32],[27,34,27,35],[29,31,29,32],[195,1,195,20],[61,40,62,40],[62,23,63,24],[65,40,66,40],[75,1,75,22],[75,23,75,24],[75,30,75,31],[65,1,65,22],[65,23,65,24],[65,30,65,31],[66,1,66,22],[66,23,66,24],[66,30,66,31],[70,1,70,35],[71,23,71,28],[71,30,71,35],[71,40,72,40],[72,23,73,24],[72,25,72,28],[72,30,73,31],[72,32,72,35],[64,30,64,31],[79,1,79,35],[80,23,80,28]]}
["「ＳＮＳチェックシート」－学級票（度数分布）－"]
[null,{"$f":"基礎データ!G3","v":0},"年",{"$f":"基礎データ!I3","v":0},"組",null,null,null,null,null,null,null,null,null,null,null,"１回目",null,null,null,null,"令和",null,{"$f":"基礎データ!H5","v":"元"},null,"年",{"$f":"基礎データ!J5","v":4},null,"月",{"$f":"基礎データ!L5","v":4},null,"日"]
[null,null,null,null,null,null,null,null,null,null,null,null,null,null,null,null,"２回目",null,null,null,null,"令和",null,{"$f":"基礎データ!H6","v":2},null,"年",{"$f":"基礎データ!J6","v":5},null,"月",{"$f":"基礎データ!L6","v":5},null,"日"]
[null,null,"【　ＳＮＳの利用実態　】"]
[]
[null,null,null,null,null,null,null,null,null,null,null,null,null,null,null,null,null,null,null,null,null,null,null,null,null,null,null,null,null,null,null,"１回目",null,null,"２回目"]
[null,"（１）",null,"ＳＮＳの１週間当たりの利用日数",null,null,null,null,null,null,null,null,null,null,null,null,null,null,null,null,"ほぼ毎日使う",null,null,null,null,null,null,null,null,null,null,{"$f":"'1回目　集計表'!$D51","v":0},null,"⇒",{"$f":"'2回目　集計表'!$D51","v":0}]
[null,null,null,null,null,null,null,null,null,null,null,null,null,null,null,null,null,null,null,null,"ときどき使う（週に３～４日くらい）",null,null,null,null,null,null,null,null,null,null,{"$f":"'1回目　集計表'!$D52","v":0},null,"⇒",{"$f":"'2回目　集計表'!$D52","v":0}]
[null,null,null,null,null,null,null,null,null,null,null,null,null,null,null,null,null,null,null,null,"あまり使わない（週に１～２日くらい）",null,null,null,null,null,null,null,null,null,null,{"$f":"'1回目　集計表'!$D53","v":0},null,"⇒",{"$f":"'2回目　集計表'!$D53","v":0}]
[null,null,null,null,null,null,null,null,null,null,null,null,null,null,null,null,null,null,null,null,"ほとんど使わない（月に数回）",null,null,null,null,null,null,null,null,null,null,{"$f":"'1回目　集計表'!$D54","v":0},null,"⇒",{"$f":"'2回目　集計表'!$D54","v":0}]
[]
[null,null,null,null,null,null,null,null,null,null,null,null,null,null,null,null,null,null,null,null,null,null,null,null,null,null,null,null,null,null,null,"１回目",null,null,"２回目"]
[null,"（２）",null,"平日にＳＮＳを利用する時間",null,null,null,null,null,null,null,null,null,null,null,null,null,null,null,null,{"$f":"ＳＮＳ学級票!U13","v":"２時間以上"},null,null,null,null,null,null,null,null,null,null,{"$f":"'1回目　集計表'!$E51","v":0},null,"⇒",{"$f":"'2回目　集計表'!$E51","v":0}]
[null,null,null,null,null,null,null,null,null,null,null,null,null,null,null,null,null,null,null,null,{"$f":"ＳＮＳ学級票!U14","v":"１～２時間未満"},null,null,null,null,null,null,null,null,null,null,{"$f":"'1回目　集計表'!$E52","v":0},null,"⇒",{"$f":"'2回目　集計表'!$E52","v":0}]
[null,null,null,null,null,null,null,null,null,null,null,null,null,null,null,null,null,null,null,null,{"$f":"ＳＮＳ学級票!U15","v":"３０分～１時間未満"},null,null,null,null,null,null,null,null,null,null,{"$f":"'1回目　集計表'!$E53","v":0},null,"⇒",{"$f":"'2回目　集計表'!$E53","v":0}]
[null,null,null,null,null,null,null,null,null,null,null,null,null,null,null,null,null,null,null,null,{"$f":"ＳＮＳ学級票!U16","v":"３０分未満"},null,null,null,null,null,null,null,null,null,null,{"$f":"'1回目　集計表'!$E54","v":0},null,"⇒",{"$f":"'2回目　集計表'!$E54","v":0}]
[]
[null,null,null,null,null,null,null,null,null,null,null,null,null,null,null,null,null,null,null,null,null,null,null,null,null,null,null,null,null,null,null,"１回目",null,null,"２回目"]
[null,"（３）",null,"ＳＮＳを使い始めてからの経験年月",null,null,null,null,null,null,null,null,null,null,null,null,null,null,null,null,{"$f":"ＳＮＳ学級票!U19","v":"２年以上"},null,null,null,null,null,null,null,null,null,null,{"$f":"'1回目　集計表'!$F51","v":0},null,"⇒",{"$f":"'2回目　集計表'!$F51","v":0}]
[null,null,null,null,null,null,null,null,null,null,null,null,null,null,null,null,null,null,null,null,{"$f":"ＳＮＳ学級票!U20","v":"１～２年"},null,null,null,null,null,null,null,null,null,null,{"$f":"'1回目　集計表'!$F52","v":0},null,"⇒",{"$f":"'2回目　集計表'!$F52","v":0}]
{"$rows_left_out":187}